aMule Forum

Please login or register.

Login with username, password and session length
Advanced search  

News:

We're back! (IN POG FORM)

Author Topic: Error compiling aMule SVN:10773  (Read 2248 times)

x_x_kamikaze_x_x

  • Jr. Member
  • **
  • Karma: 18
  • Offline Offline
  • Posts: 83
Error compiling aMule SVN:10773
« on: April 12, 2012, 06:28:13 PM »

Hi aMule Team!

Sorry for every time I contact with you it's just for telling problems... I apologize.

The aMule code have a error when I try to compile it:

SVN: 10773

Commands used to download the source code:
Code: [Select]
svn checkout http://amule.googlecode.com/svn/trunk/ ./

Command used to create the config:
Code: [Select]
./autogen.sh

Output:
Code: [Select]
Setting up internationalization files.
Copying file intl/ChangeLog
Copying file intl/Makefile.in
Copying file intl/VERSION
Copying file intl/bindtextdom.c
Copying file intl/config.charset
Copying file intl/dcgettext.c
Copying file intl/dcigettext.c
Copying file intl/dcngettext.c
Copying file intl/dgettext.c
Copying file intl/dngettext.c
Copying file intl/eval-plural.h
Copying file intl/explodename.c
Copying file intl/finddomain.c
Copying file intl/gettext.c
Copying file intl/gettextP.h
Copying file intl/gmo.h
Copying file intl/hash-string.h
Copying file intl/intl-compat.c
Copying file intl/l10nflist.c
Copying file intl/libgnuintl.h
Copying file intl/loadinfo.h
Copying file intl/loadmsgcat.c
Copying file intl/localcharset.c
Copying file intl/locale.alias
Copying file intl/localealias.c
Copying file intl/localename.c
Copying file intl/ngettext.c
Copying file intl/os2compat.c
Copying file intl/os2compat.h
Copying file intl/osdep.c
Copying file intl/plural-exp.c
Copying file intl/plural-exp.h
Copying file intl/plural.c
Copying file intl/plural.y
Copying file intl/ref-add.sin
Copying file intl/ref-del.sin
Copying file intl/textdomain.c
Copying file mkinstalldirs
Copying file po/Makefile.in.in
autopoint does not honor dataroot variable, patching.
Running aclocal -I m4
Running autoheader
Running autoconf
Creating pixmaps Makefile.am
Running automake --foreign -a -c -f

Command used to configure the aMule code:
Code: [Select]
./configure --enable-optimize --enable-cas --enable-wxcas --enable-alc --enable-alcc --enable-xas --enable-geoip --enable-mmap --enable-fileview --with-zlib --enable-ccache --enable-debug

Output:
Code: [Select]
checking for a BSD-compatible install... /usr/bin/install -c
checking whether build environment is sane... yes
checking for a thread-safe mkdir -p... /bin/mkdir -p
checking for gawk... gawk
checking whether make sets $(MAKE)... yes
checking whether to enable maintainer-specific portions of Makefiles... no
checking build system type... x86_64-unknown-linux-gnu
checking host system type... x86_64-unknown-linux-gnu
checking if this is a FreeBSD 4 or earlier system... no
checking for g++... g++
checking whether the C++ compiler works... yes
checking for C++ compiler default output file name... a.out
checking for suffix of executables...
checking whether we are cross compiling... no
checking for suffix of object files... o
checking whether we are using the GNU C++ compiler... yes
checking whether g++ accepts -g... yes
checking for style of include used by make... GNU
checking dependency style of g++... gcc3
checking how to run the C++ preprocessor... g++ -E
checking for gcc... gcc
checking whether we are using the GNU C compiler... yes
checking whether gcc accepts -g... yes
checking for gcc option to accept ISO C89... none needed
checking dependency style of gcc... gcc3
checking how to run the C preprocessor... gcc -E
checking for gawk... (cached) gawk
checking for grep that handles long lines and -e... /bin/grep
checking for egrep... /bin/grep -E
checking whether make sets $(MAKE)... (cached) yes
checking for flex... flex
checking lex output file root... lex.yy
checking lex library... -lfl
checking whether yytext is a pointer... yes
checking for ranlib... ranlib
checking for bison... bison -y
checking for ranlib... (cached) ranlib
checking for strip... strip
checking for ar... ar
checking for ld... ld
checking for zlib >= 1.1.4... yes (version 1.2.3.4)
checking for ANSI C header files... yes
checking for sys/types.h... yes
checking for sys/stat.h... yes
checking for stdlib.h... yes
checking for string.h... yes
checking for memory.h... yes
checking for strings.h... yes
checking for inttypes.h... yes
checking for stdint.h... yes
checking for unistd.h... yes
checking for gdlib-config... /usr/bin/gdlib-config
checking for gdlib version >= 2.0.0... yes (version 2.0.36)
checking gd.h usability... yes
checking gd.h presence... yes
checking for gd.h... yes
checking for File::Copy... ok
checking GeoIP.h usability... yes
checking GeoIP.h presence... yes
checking for GeoIP.h... yes
checking for GeoIP_open in -lGeoIP... yes
checking for the --with-toolkit option... will be automatically detected
checking for the --with-wxshared option... will be automatically detected
checking for the --with-wxdebug option... will be automatically detected
checking for the --with-wxversion option... will be automatically detected
checking for wx-config... /usr/bin/wx-config
checking for wxWidgets version >= 2.8.12 (--unicode=yes)... yes (version 2.8.12)
checking if wxWidgets was built in DEBUG mode... no
checking if wxWidgets was built in STATIC mode... no
checking which wxWidgets toolkit was selected... gtk2
checking for pkg-config... /usr/bin/pkg-config
checking pkg-config is at least version 0.9.0... yes
checking for libupnp version >= 1.6.6... yes (version 1.8.0~svn20100401)
checking for crypto++ version >= 5.1... yes (version 5.6.1, installed)
checking whether the C++ compiler (g++) uses strict aliasing... no
checking that wxWidgets has support for large files... yes
checking for exception-handling... yes
checking typeinfo usability... yes
checking typeinfo presence... yes
checking for typeinfo... yes
checking for <cxxabi.h> and __cxa_demangle()... yes
checking for extended flex capabilities... yes
checking for size_t... yes
checking for working alloca.h... yes
checking for alloca... yes
checking for dirent.h that defines DIR... yes
checking for library containing opendir... none required
checking for ANSI C header files... (cached) yes
checking argz.h usability... yes
checking argz.h presence... yes
checking for argz.h... yes
checking arpa/inet.h usability... yes
checking arpa/inet.h presence... yes
checking for arpa/inet.h... yes
checking fcntl.h usability... yes
checking fcntl.h presence... yes
checking for fcntl.h... yes
checking for inttypes.h... (cached) yes
checking langinfo.h usability... yes
checking langinfo.h presence... yes
checking for langinfo.h... yes
checking libintl.h usability... yes
checking libintl.h presence... yes
checking for libintl.h... yes
checking limits.h usability... yes
checking limits.h presence... yes
checking for limits.h... yes
checking locale.h usability... yes
checking locale.h presence... yes
checking for locale.h... yes
checking malloc.h usability... yes
checking malloc.h presence... yes
checking for malloc.h... yes
checking mntent.h usability... yes
checking mntent.h presence... yes
checking for mntent.h... yes
checking netdb.h usability... yes
checking netdb.h presence... yes
checking for netdb.h... yes
checking netinet/in.h usability... yes
checking netinet/in.h presence... yes
checking for netinet/in.h... yes
checking stddef.h usability... yes
checking stddef.h presence... yes
checking for stddef.h... yes
checking nl_types.h usability... yes
checking nl_types.h presence... yes
checking for nl_types.h... yes
checking for stdint.h... (cached) yes
checking stdio_ext.h usability... yes
checking stdio_ext.h presence... yes
checking for stdio_ext.h... yes
checking for stdlib.h... (cached) yes
checking for string.h... (cached) yes
checking for strings.h... (cached) yes
checking sys/ioctl.h usability... yes
checking sys/ioctl.h presence... yes
checking for sys/ioctl.h... yes
checking sys/mntent.h usability... no
checking sys/mntent.h presence... no
checking for sys/mntent.h... no
checking sys/mnttab.h usability... no
checking sys/mnttab.h presence... no
checking for sys/mnttab.h... no
checking sys/mount.h usability... yes
checking sys/mount.h presence... yes
checking for sys/mount.h... yes
checking sys/param.h usability... yes
checking sys/param.h presence... yes
checking for sys/param.h... yes
checking sys/resource.h usability... yes
checking sys/resource.h presence... yes
checking for sys/resource.h... yes
checking sys/select.h usability... yes
checking sys/select.h presence... yes
checking for sys/select.h... yes
checking sys/socket.h usability... yes
checking sys/socket.h presence... yes
checking for sys/socket.h... yes
checking sys/statvfs.h usability... yes
checking sys/statvfs.h presence... yes
checking for sys/statvfs.h... yes
checking sys/time.h usability... yes
checking sys/time.h presence... yes
checking for sys/time.h... yes
checking sys/timeb.h usability... yes
checking sys/timeb.h presence... yes
checking for sys/timeb.h... yes
checking for sys/types.h... (cached) yes
checking for unistd.h... (cached) yes
checking errno.h usability... yes
checking errno.h presence... yes
checking for errno.h... yes
checking signal.h usability... yes
checking signal.h presence... yes
checking for signal.h... yes
checking for sys/wait.h that is POSIX.1 compatible... yes
checking for stdbool.h that conforms to C99... yes
checking for _Bool... yes
checking for an ANSI C-conforming const... yes
checking for inline... inline
checking for mode_t... yes
checking for off_t... yes
checking for size_t... (cached) yes
checking whether time.h and sys/time.h may both be included... yes
checking whether struct tm is in sys/time.h or time.h... time.h
checking for uid_t in sys/types.h... yes
checking for working volatile... yes
checking for ptrdiff_t... yes
checking whether closedir returns void... no
checking whether gcc needs -traditional... no
checking for pid_t... yes
checking vfork.h usability... no
checking vfork.h presence... no
checking for vfork.h... no
checking for fork... yes
checking for vfork... yes
checking for working fork... yes
checking for working vfork... (cached) yes
checking whether lstat correctly handles trailing slash... yes
checking for library containing getmntent... none required
checking whether lstat accepts an empty string... no
checking whether lstat correctly handles trailing slash... (cached) yes
checking for working memcmp... yes
checking for sys/select.h... (cached) yes
checking for sys/socket.h... (cached) yes
checking types of arguments for select... int,fd_set *,struct timeval *
checking return type of signal handlers... void
checking whether stat accepts an empty string... no
checking for strftime... yes
checking for working strtod... yes
checking for vprintf... yes
checking for _doprnt... no
checking for stdlib.h... (cached) yes
checking for GNU libc compatible malloc... yes
checking for stdlib.h... (cached) yes
checking for GNU libc compatible realloc... yes
checking for __argz_count... yes
checking for __argz_next... yes
checking for __argz_stringify... yes
checking for endpwent... yes
checking for floor... no
checking for ftruncate... yes
checking for getcwd... yes
checking for gethostbyaddr... yes
checking for gethostbyname... yes
checking for gethostname... yes
checking for getpass... yes
checking for gettimeofday... yes
checking for inet_ntoa... yes
checking for localeconv... yes
checking for memmove... yes
checking for mempcpy... yes
checking for memset... yes
checking for nl_langinfo... yes
checking for pow... no
checking for select... yes
checking for setlocale... yes
checking for socket... yes
checking for sqrt... no
checking for stpcpy... yes
checking for strcasecmp... yes
checking for strchr... yes
checking for strcspn... yes
checking for strdup... yes
checking for strerror... yes
checking for strncasecmp... yes
checking for strstr... yes
checking for strtoul... yes
checking for sigaction... yes
checking for mkdir... yes
checking for getrlimit... yes
checking for setrlimit... yes
checking for getopt_long... yes
checking for stdlib.h... (cached) yes
checking for unistd.h... (cached) yes
checking for sys/param.h... (cached) yes
checking sys/mman.h usability... yes
checking sys/mman.h presence... yes
checking for sys/mman.h... yes
checking for getpagesize... yes
checking for working mmap... yes
checking for munmap... yes
checking for sysconf... yes
checking for pagesize constant for sysconf... _SC_PAGESIZE
checking whether strerror_r is declared... yes
checking for strerror_r... yes
checking whether strerror_r returns char *... no
checking for fallocate... yes
checking for SYS_fallocate... yes
checking for posix_fallocate... yes
checking for msgfmt... /usr/bin/msgfmt
checking for gmsgfmt... /usr/bin/msgfmt
checking for xgettext... /usr/bin/xgettext
checking for msgmerge... /usr/bin/msgmerge
checking for strerror in -lcposix... no
checking whether we are using the GNU C Library 2.1 or newer... yes
checking whether integer division by zero raises SIGFPE... yes
checking for inttypes.h... yes
checking for stdint.h... yes
checking for unsigned long long... yes
checking for inttypes.h... yes
checking whether the inttypes.h PRIxNN macros are broken... no
checking for ld used by GCC... ld
checking if the linker (ld) is GNU ld... yes
checking for shared library run path origin... done
checking for argz.h... (cached) yes
checking for limits.h... (cached) yes
checking for locale.h... (cached) yes
checking for nl_types.h... (cached) yes
checking for malloc.h... (cached) yes
checking for stddef.h... (cached) yes
checking for stdlib.h... (cached) yes
checking for string.h... (cached) yes
checking for unistd.h... (cached) yes
checking for sys/param.h... (cached) yes
checking for feof_unlocked... yes
checking for fgets_unlocked... yes
checking for getc_unlocked... yes
checking for getcwd... (cached) yes
checking for getegid... yes
checking for geteuid... yes
checking for getgid... yes
checking for getuid... yes
checking for mempcpy... (cached) yes
checking for munmap... (cached) yes
checking for putenv... yes
checking for setenv... yes
checking for setlocale... (cached) yes
checking for stpcpy... (cached) yes
checking for strcasecmp... (cached) yes
checking for strdup... (cached) yes
checking for strtoul... (cached) yes
checking for tsearch... yes
checking for __argz_count... (cached) yes
checking for __argz_stringify... (cached) yes
checking for __argz_next... (cached) yes
checking for iconv... yes
checking for iconv declaration...
         extern size_t iconv (iconv_t cd, char * *inbuf, size_t *inbytesleft, char * *outbuf, size_t *outbytesleft);
checking for nl_langinfo and CODESET... yes
checking for LC_MESSAGES... yes
checking for bison... bison
checking version of bison... 2.4.1, ok
checking whether NLS is requested... yes
checking whether included gettext is requested... no
checking for GNU gettext in libc... yes
checking for autopoint... yes (0.18.1)
checking for requested languages... all
checking for bfd... yes
checking for <execinfo.h> and backtrace()... yes
checking for docdir... ${datarootdir}/doc/${PACKAGE_TARNAME}
checking for SVNDATE... rev. 10773
checking denoising level... 0
checking whether ccache support should be added... yes
checking for ccache presence... dirname: missing operand
Try `dirname --help' for more information.
no
configure: creating ./config.status
config.status: creating Makefile
config.status: creating docs/Makefile
config.status: creating docs/man/Makefile
config.status: creating intl/Makefile
config.status: creating src/Makefile
config.status: creating src/pixmaps/Makefile
config.status: creating src/pixmaps/flags_xpm/Makefile
config.status: creating src/libs/Makefile
config.status: creating src/libs/ec/Makefile
config.status: creating src/libs/ec/cpp/Makefile
config.status: creating src/libs/common/Makefile
config.status: creating src/utils/Makefile
config.status: creating src/utils/aLinkCreator/Makefile
config.status: creating src/utils/aLinkCreator/docs/Makefile
config.status: creating src/utils/aLinkCreator/src/Makefile
config.status: creating src/utils/cas/Makefile
config.status: creating src/utils/cas/docs/Makefile
config.status: creating src/utils/fileview/Makefile
config.status: creating src/utils/plasmamule/Makefile
config.status: creating src/utils/wxCas/Makefile
config.status: creating src/utils/wxCas/docs/Makefile
config.status: creating src/utils/wxCas/src/Makefile
config.status: creating src/utils/xas/Makefile
config.status: creating src/utils/xas/autostart-xas
config.status: creating src/utils/xas/docs/Makefile
config.status: creating src/skins/Makefile
config.status: creating src/webserver/Makefile
config.status: creating src/webserver/src/Makefile
config.status: creating src/webserver/default/Makefile
config.status: creating unittests/Makefile
config.status: creating unittests/muleunit/Makefile
config.status: creating unittests/tests/Makefile
config.status: creating po/Makefile.in
config.status: creating Compilation.flags
config.status: creating config.h
config.status: config.h is unchanged
config.status: executing depfiles commands
config.status: executing default-1 commands
config.status: creating po/POTFILES
config.status: creating po/Makefile
config.status: executing denoiser commands


  Configure script has finished system check.

  Configured aMule SVN (rev. 10773) for 'x86_64-unknown-linux-gnu'.

  aMule enabled options:

  **** aMule Core ****
  Prefix where aMule should be installed?                    /usr/local
  Should aMule be compiled with i18n support?                yes
  Should aMule be compiled in debug mode?                    yes
  Should aMule be compiled with profiling?                   no
  Should aMule be compiled with optimizations?               yes
  Should aMule be compiled with UPnP support?                yes
  Should aMule be compiled with IP2country support?          yes
  Should aMule monolithic application be built?              yes
  Should aMule daemon version be built?                      no
  Should aMule remote gui be built?                          no
  Crypto++ library/headers style?                            installed

  **** aMule TextClient ****
  Should aMule Command Line Client be built?                 no

  **** aMule WebServer ****
  Should aMule WebServer be built?                           no

  **** aMule ED2K Links Handler ****
  Should aMule ED2K Links Handler be built?                  yes

  **** aMuleLinkCreator ****
  Should aMuleLinkCreator GUI version (alc) be built?        yes
  Should aMuleLinkCreator for console (alcc) be built?       yes

  **** aMule Statistics ****
  Should C aMule Statistics (CAS) be built?                  yes
  Should aMule GUI Statistics (wxCas) be built?              yes
  Should xas XChat2 plugin be installed?                     yes
  Should plasmaMule plasma-applet be build?                  no

  **** General Libraries and Tools ****
  Should ccache support be enabled?                          no
  Libraries aMule will use to build:
                             wxWidgets             2.8.12 (gtk2,shared)
                             crypto++              5.6.1 (installed, in /usr)
                             libupnp               1.8.0~svn20100401
                             libintl               system
                             libGeoIP              system
                             libgd                 2.0.36
                             zlib                  1.2.3.4

Command for compile:
Code: [Select]
sudo rm -r /
XDDDD  Joking   ;)
Code: [Select]
make

Logged

x_x_kamikaze_x_x

  • Jr. Member
  • **
  • Karma: 18
  • Offline Offline
  • Posts: 83
Re: Error compiling aMule SVN:10773
« Reply #1 on: April 12, 2012, 06:28:52 PM »

Output and error:
Code: [Select]
make  all-recursive
make[1]: Entering directory `/home/kami/Desktop/aMule'
Making all in intl
make[2]: Entering directory `/home/kami/Desktop/aMule/intl'
make[2]: Nothing to be done for `all'.
make[2]: Leaving directory `/home/kami/Desktop/aMule/intl'
Making all in po
make[2]: Entering directory `/home/kami/Desktop/aMule/po'
make[2]: Nothing to be done for `all'.
make[2]: Leaving directory `/home/kami/Desktop/aMule/po'
Making all in docs
make[2]: Entering directory `/home/kami/Desktop/aMule/docs'
Making all in man
make[3]: Entering directory `/home/kami/Desktop/aMule/docs/man'
make[3]: Nothing to be done for `all'.
make[3]: Leaving directory `/home/kami/Desktop/aMule/docs/man'
make[3]: Entering directory `/home/kami/Desktop/aMule/docs'
make[3]: Nothing to be done for `all-am'.
make[3]: Leaving directory `/home/kami/Desktop/aMule/docs'
make[2]: Leaving directory `/home/kami/Desktop/aMule/docs'
Making all in src
make[2]: Entering directory `/home/kami/Desktop/aMule/src'
Making all in libs
make[3]: Entering directory `/home/kami/Desktop/aMule/src/libs'
Making all in common
make[4]: Entering directory `/home/kami/Desktop/aMule/src/libs/common'
make[4]: Nothing to be done for `all'.
make[4]: Leaving directory `/home/kami/Desktop/aMule/src/libs/common'
Making all in ec
make[4]: Entering directory `/home/kami/Desktop/aMule/src/libs/ec'
make  all-recursive
make[5]: Entering directory `/home/kami/Desktop/aMule/src/libs/ec'
Making all in cpp
make[6]: Entering directory `/home/kami/Desktop/aMule/src/libs/ec/cpp'
make  all-am
make[7]: Entering directory `/home/kami/Desktop/aMule/src/libs/ec/cpp'
make[7]: Nothing to be done for `all-am'.
make[7]: Leaving directory `/home/kami/Desktop/aMule/src/libs/ec/cpp'
make[6]: Leaving directory `/home/kami/Desktop/aMule/src/libs/ec/cpp'
make[6]: Entering directory `/home/kami/Desktop/aMule/src/libs/ec'
make[6]: Nothing to be done for `all-am'.
make[6]: Leaving directory `/home/kami/Desktop/aMule/src/libs/ec'
make[5]: Leaving directory `/home/kami/Desktop/aMule/src/libs/ec'
make[4]: Leaving directory `/home/kami/Desktop/aMule/src/libs/ec'
make[4]: Entering directory `/home/kami/Desktop/aMule/src/libs'
make[4]: Nothing to be done for `all-am'.
make[4]: Leaving directory `/home/kami/Desktop/aMule/src/libs'
make[3]: Leaving directory `/home/kami/Desktop/aMule/src/libs'
Making all in utils
make[3]: Entering directory `/home/kami/Desktop/aMule/src/utils'
Making all in fileview
make[4]: Entering directory `/home/kami/Desktop/aMule/src/utils/fileview'
make[4]: Nothing to be done for `all'.
make[4]: Leaving directory `/home/kami/Desktop/aMule/src/utils/fileview'
Making all in xas
make[4]: Entering directory `/home/kami/Desktop/aMule/src/utils/xas'
Making all in docs
make[5]: Entering directory `/home/kami/Desktop/aMule/src/utils/xas/docs'
make[5]: Nothing to be done for `all'.
make[5]: Leaving directory `/home/kami/Desktop/aMule/src/utils/xas/docs'
make[5]: Entering directory `/home/kami/Desktop/aMule/src/utils/xas'
make[5]: Nothing to be done for `all-am'.
make[5]: Leaving directory `/home/kami/Desktop/aMule/src/utils/xas'
make[4]: Leaving directory `/home/kami/Desktop/aMule/src/utils/xas'
Making all in cas
make[4]: Entering directory `/home/kami/Desktop/aMule/src/utils/cas'
Making all in docs
make[5]: Entering directory `/home/kami/Desktop/aMule/src/utils/cas/docs'
make[5]: Nothing to be done for `all'.
make[5]: Leaving directory `/home/kami/Desktop/aMule/src/utils/cas/docs'
make[5]: Entering directory `/home/kami/Desktop/aMule/src/utils/cas'
make[5]: Nothing to be done for `all-am'.
make[5]: Leaving directory `/home/kami/Desktop/aMule/src/utils/cas'
make[4]: Leaving directory `/home/kami/Desktop/aMule/src/utils/cas'
Making all in wxCas
make[4]: Entering directory `/home/kami/Desktop/aMule/src/utils/wxCas'
Making all in src
make[5]: Entering directory `/home/kami/Desktop/aMule/src/utils/wxCas/src'
make[5]: Nothing to be done for `all'.
make[5]: Leaving directory `/home/kami/Desktop/aMule/src/utils/wxCas/src'
Making all in docs
make[5]: Entering directory `/home/kami/Desktop/aMule/src/utils/wxCas/docs'
make[5]: Nothing to be done for `all'.
make[5]: Leaving directory `/home/kami/Desktop/aMule/src/utils/wxCas/docs'
make[5]: Entering directory `/home/kami/Desktop/aMule/src/utils/wxCas'
make[5]: Nothing to be done for `all-am'.
make[5]: Leaving directory `/home/kami/Desktop/aMule/src/utils/wxCas'
make[4]: Leaving directory `/home/kami/Desktop/aMule/src/utils/wxCas'
Making all in aLinkCreator
make[4]: Entering directory `/home/kami/Desktop/aMule/src/utils/aLinkCreator'
Making all in src
make[5]: Entering directory `/home/kami/Desktop/aMule/src/utils/aLinkCreator/src'
make[5]: Nothing to be done for `all'.
make[5]: Leaving directory `/home/kami/Desktop/aMule/src/utils/aLinkCreator/src'
Making all in docs
make[5]: Entering directory `/home/kami/Desktop/aMule/src/utils/aLinkCreator/docs'
make[5]: Nothing to be done for `all'.
make[5]: Leaving directory `/home/kami/Desktop/aMule/src/utils/aLinkCreator/docs'
make[5]: Entering directory `/home/kami/Desktop/aMule/src/utils/aLinkCreator'
make[5]: Nothing to be done for `all-am'.
make[5]: Leaving directory `/home/kami/Desktop/aMule/src/utils/aLinkCreator'
make[4]: Leaving directory `/home/kami/Desktop/aMule/src/utils/aLinkCreator'
make[4]: Entering directory `/home/kami/Desktop/aMule/src/utils'
make[4]: Nothing to be done for `all-am'.
make[4]: Leaving directory `/home/kami/Desktop/aMule/src/utils'
make[3]: Leaving directory `/home/kami/Desktop/aMule/src/utils'
Making all in pixmaps
make[3]: Entering directory `/home/kami/Desktop/aMule/src/pixmaps'
Making all in flags_xpm
make[4]: Entering directory `/home/kami/Desktop/aMule/src/pixmaps/flags_xpm'
make[4]: Nothing to be done for `all'.
make[4]: Leaving directory `/home/kami/Desktop/aMule/src/pixmaps/flags_xpm'
make[4]: Entering directory `/home/kami/Desktop/aMule/src/pixmaps'
make[4]: Nothing to be done for `all-am'.
make[4]: Leaving directory `/home/kami/Desktop/aMule/src/pixmaps'
make[3]: Leaving directory `/home/kami/Desktop/aMule/src/pixmaps'
Making all in skins
make[3]: Entering directory `/home/kami/Desktop/aMule/src/skins'
make[3]: Nothing to be done for `all'.
make[3]: Leaving directory `/home/kami/Desktop/aMule/src/skins'
make[3]: Entering directory `/home/kami/Desktop/aMule/src'
g++ -DHAVE_CONFIG_H -I. -I..  -D__DEBUG__ -DUSE_WX_EXTENSIONS -I/usr/lib/wx/include/gtk2-unicode-release-2.8 -I/usr/include/wx-2.8 -D_FILE_OFFSET_BITS=64 -D_LARGE_FILES -D__WXGTK__ -DwxUSE_GUI=0 -I./libs -I./include -I/usr/include -D__WEAK_CRYPTO__ -I/usr/include/upnp   -DENABLE_UPNP=1  -g -W -Wall -Wshadow -Wundef -ggdb -fno-inline -fmessage-length=0 -O2  -MT libmuleappcore_a-UPnPBase.o -MD -MP -MF .deps/libmuleappcore_a-UPnPBase.Tpo -c -o libmuleappcore_a-UPnPBase.o `test -f 'UPnPBase.cpp' || echo './'`UPnPBase.cpp
UPnPBase.cpp: In constructor ‘CUPnPControlPoint::CUPnPControlPoint(short unsigned int)’:
UPnPBase.cpp:871:37: error: invalid conversion from ‘const char*’ to ‘char*’ [-fpermissive]
UPnPBase.cpp: In static member function ‘static int CUPnPControlPoint::Callback(Upnp_EventType, void*, void*)’:
UPnPBase.cpp:1189:14: error: invalid use of incomplete type ‘struct CUPnPControlPoint::Callback(Upnp_EventType, void*, void*)::Upnp_Discovery’
UPnPBase.cpp:1186:10: error: forward declaration of ‘struct CUPnPControlPoint::Callback(Upnp_EventType, void*, void*)::Upnp_Discovery’
UPnPBase.cpp:1190:56: error: invalid use of incomplete type ‘struct CUPnPControlPoint::Callback(Upnp_EventType, void*, void*)::Upnp_Discovery’
UPnPBase.cpp:1186:10: error: forward declaration of ‘struct CUPnPControlPoint::Callback(Upnp_EventType, void*, void*)::Upnp_Discovery’
UPnPBase.cpp:1194:35: error: invalid use of incomplete type ‘struct CUPnPControlPoint::Callback(Upnp_EventType, void*, void*)::Upnp_Discovery’
UPnPBase.cpp:1186:10: error: forward declaration of ‘struct CUPnPControlPoint::Callback(Upnp_EventType, void*, void*)::Upnp_Discovery’
UPnPBase.cpp:1197:12: error: invalid use of incomplete type ‘struct CUPnPControlPoint::Callback(Upnp_EventType, void*, void*)::Upnp_Discovery’
UPnPBase.cpp:1186:10: error: forward declaration of ‘struct CUPnPControlPoint::Callback(Upnp_EventType, void*, void*)::Upnp_Discovery’
UPnPBase.cpp:1203:12: error: invalid use of incomplete type ‘struct CUPnPControlPoint::Callback(Upnp_EventType, void*, void*)::Upnp_Discovery’
UPnPBase.cpp:1186:10: error: forward declaration of ‘struct CUPnPControlPoint::Callback(Upnp_EventType, void*, void*)::Upnp_Discovery’
UPnPBase.cpp:1236:13: error: invalid use of incomplete type ‘struct CUPnPControlPoint::Callback(Upnp_EventType, void*, void*)::Upnp_Discovery’
UPnPBase.cpp:1186:10: error: forward declaration of ‘struct CUPnPControlPoint::Callback(Upnp_EventType, void*, void*)::Upnp_Discovery’
UPnPBase.cpp:1236:32: error: invalid use of incomplete type ‘struct CUPnPControlPoint::Callback(Upnp_EventType, void*, void*)::Upnp_Discovery’
UPnPBase.cpp:1186:10: error: forward declaration of ‘struct CUPnPControlPoint::Callback(Upnp_EventType, void*, void*)::Upnp_Discovery’
UPnPBase.cpp:1258:16: error: invalid use of incomplete type ‘struct CUPnPControlPoint::Callback(Upnp_EventType, void*, void*)::Upnp_Discovery’
UPnPBase.cpp:1257:10: error: forward declaration of ‘struct CUPnPControlPoint::Callback(Upnp_EventType, void*, void*)::Upnp_Discovery’
UPnPBase.cpp:1260:52: error: invalid use of incomplete type ‘struct CUPnPControlPoint::Callback(Upnp_EventType, void*, void*)::Upnp_Discovery’
UPnPBase.cpp:1257:10: error: forward declaration of ‘struct CUPnPControlPoint::Callback(Upnp_EventType, void*, void*)::Upnp_Discovery’
UPnPBase.cpp:1264:34: error: invalid use of incomplete type ‘struct CUPnPControlPoint::Callback(Upnp_EventType, void*, void*)::Upnp_Discovery’
UPnPBase.cpp:1257:10: error: forward declaration of ‘struct CUPnPControlPoint::Callback(Upnp_EventType, void*, void*)::Upnp_Discovery’
UPnPBase.cpp:1268:38: error: invalid use of incomplete type ‘struct CUPnPControlPoint::Callback(Upnp_EventType, void*, void*)::Upnp_Discovery’
UPnPBase.cpp:1257:10: error: forward declaration of ‘struct CUPnPControlPoint::Callback(Upnp_EventType, void*, void*)::Upnp_Discovery’
UPnPBase.cpp:1276:34: error: invalid use of incomplete type ‘struct CUPnPControlPoint::Callback(Upnp_EventType, void*, void*)::Upnp_Event’
UPnPBase.cpp:1275:10: error: forward declaration of ‘struct CUPnPControlPoint::Callback(Upnp_EventType, void*, void*)::Upnp_Event’
UPnPBase.cpp:1278:39: error: invalid use of incomplete type ‘struct CUPnPControlPoint::Callback(Upnp_EventType, void*, void*)::Upnp_Event’
UPnPBase.cpp:1275:10: error: forward declaration of ‘struct CUPnPControlPoint::Callback(Upnp_EventType, void*, void*)::Upnp_Event’
UPnPBase.cpp:1278:58: error: invalid use of incomplete type ‘struct CUPnPControlPoint::Callback(Upnp_EventType, void*, void*)::Upnp_Event’
UPnPBase.cpp:1275:10: error: forward declaration of ‘struct CUPnPControlPoint::Callback(Upnp_EventType, void*, void*)::Upnp_Event’
UPnPBase.cpp:1295:15: error: invalid use of incomplete type ‘struct CUPnPControlPoint::Callback(Upnp_EventType, void*, void*)::Upnp_Event_Subscribe’
UPnPBase.cpp:1293:10: error: forward declaration of ‘struct CUPnPControlPoint::Callback(Upnp_EventType, void*, void*)::Upnp_Event_Subscribe’
UPnPBase.cpp:1298:24: error: invalid use of incomplete type ‘struct CUPnPControlPoint::Callback(Upnp_EventType, void*, void*)::Upnp_Event_Subscribe’
UPnPBase.cpp:1293:10: error: forward declaration of ‘struct CUPnPControlPoint::Callback(Upnp_EventType, void*, void*)::Upnp_Event_Subscribe’
UPnPBase.cpp:1327:12: error: invalid use of incomplete type ‘struct CUPnPControlPoint::Callback(Upnp_EventType, void*, void*)::Upnp_Event_Subscribe’
UPnPBase.cpp:1321:10: error: forward declaration of ‘struct CUPnPControlPoint::Callback(Upnp_EventType, void*, void*)::Upnp_Event_Subscribe’
UPnPBase.cpp:1333:24: error: invalid use of incomplete type ‘struct CUPnPControlPoint::Callback(Upnp_EventType, void*, void*)::Upnp_Event_Subscribe’
UPnPBase.cpp:1321:10: error: forward declaration of ‘struct CUPnPControlPoint::Callback(Upnp_EventType, void*, void*)::Upnp_Event_Subscribe’
UPnPBase.cpp:1336:39: error: invalid use of incomplete type ‘struct CUPnPControlPoint::Callback(Upnp_EventType, void*, void*)::Upnp_Event_Subscribe’
UPnPBase.cpp:1321:10: error: forward declaration of ‘struct CUPnPControlPoint::Callback(Upnp_EventType, void*, void*)::Upnp_Event_Subscribe’
UPnPBase.cpp:1342:14: error: invalid use of incomplete type ‘struct CUPnPControlPoint::Callback(Upnp_EventType, void*, void*)::Upnp_Event_Subscribe’
UPnPBase.cpp:1321:10: error: forward declaration of ‘struct CUPnPControlPoint::Callback(Upnp_EventType, void*, void*)::Upnp_Event_Subscribe’
UPnPBase.cpp:1363:14: error: invalid use of incomplete type ‘struct CUPnPControlPoint::Callback(Upnp_EventType, void*, void*)::Upnp_Action_Complete’
UPnPBase.cpp:1361:10: error: forward declaration of ‘struct CUPnPControlPoint::Callback(Upnp_EventType, void*, void*)::Upnp_Action_Complete’
UPnPBase.cpp:1366:12: error: invalid use of incomplete type ‘struct CUPnPControlPoint::Callback(Upnp_EventType, void*, void*)::Upnp_Action_Complete’
UPnPBase.cpp:1361:10: error: forward declaration of ‘struct CUPnPControlPoint::Callback(Upnp_EventType, void*, void*)::Upnp_Action_Complete’
UPnPBase.cpp:1367:12: error: invalid use of incomplete type ‘struct CUPnPControlPoint::Callback(Upnp_EventType, void*, void*)::Upnp_Action_Complete’
UPnPBase.cpp:1361:10: error: forward declaration of ‘struct CUPnPControlPoint::Callback(Upnp_EventType, void*, void*)::Upnp_Action_Complete’
UPnPBase.cpp:1371:12: error: invalid use of incomplete type ‘struct CUPnPControlPoint::Callback(Upnp_EventType, void*, void*)::Upnp_Action_Complete’
UPnPBase.cpp:1361:10: error: forward declaration of ‘struct CUPnPControlPoint::Callback(Upnp_EventType, void*, void*)::Upnp_Action_Complete’
UPnPBase.cpp:1384:15: error: invalid use of incomplete type ‘struct CUPnPControlPoint::Callback(Upnp_EventType, void*, void*)::Upnp_State_Var_Complete’
UPnPBase.cpp:1382:10: error: forward declaration of ‘struct CUPnPControlPoint::Callback(Upnp_EventType, void*, void*)::Upnp_State_Var_Complete’
UPnPBase.cpp:1387:24: error: invalid use of incomplete type ‘struct CUPnPControlPoint::Callback(Upnp_EventType, void*, void*)::Upnp_State_Var_Complete’
UPnPBase.cpp:1382:10: error: forward declaration of ‘struct CUPnPControlPoint::Callback(Upnp_EventType, void*, void*)::Upnp_State_Var_Complete’
make[3]: *** [libmuleappcore_a-UPnPBase.o] Error 1
make[3]: Leaving directory `/home/kami/Desktop/aMule/src'
make[2]: *** [all-recursive] Error 1
make[2]: Leaving directory `/home/kami/Desktop/aMule/src'
make[1]: *** [all-recursive] Error 1
make[1]: Leaving directory `/home/kami/Desktop/aMule'
make: *** [all] Error 2

Other important info:
Code: [Select]
kami@mariaX:~/Desktop/aMule$ uname -a
Linux mariaX 3.0.0-17-server #30-Ubuntu SMP Thu Mar 8 22:15:30 UTC 2012 x86_64 x86_64 x86_64 GNU/Linux


Some advise, please, aMule code gurus?  :)

See you soon!  ;D
Logged

Stu Redman

  • Administrator
  • Hero Member
  • *****
  • Karma: 214
  • Offline Offline
  • Posts: 3764
  • Engines screaming
Re: Error compiling aMule SVN:10773
« Reply #2 on: April 12, 2012, 08:00:28 PM »

Sorry for every time I contact with you it's just for telling problems... I apologize.
No need to apologize, we are always thankful for feedback!

Command for compile:
Code: [Select]
sudo rm -r /
XDDDD  Joking   ;)
LOL, I hope nobody copies that blindly...  ;D

Problem is here:
Code: [Select]
  Libraries aMule will use to build:
                             wxWidgets             2.8.12 (gtk2,shared)
                             crypto++              5.6.1 (installed, in /usr)
                             libupnp               1.8.0~svn20100401

It's supposed to be
Code: [Select]
                             libupnp               1.6.6

Did you change anything in your Linux installation regarding UPnP?
1.6.6 is the one and only version that works.
The correct Ubuntu package is libupnp3-dev .
Easiest way to fix it is of course to add --disable-upnp to your configure options. If you have forwarded your ports in your router you don't need UPnP.


Logged
The image of mother goddess, lying dormant in the eyes of the dead, the sheaf of the corn is broken, end the harvest, throw the dead on the pyre -- Iron Maiden, Isle of Avalon

x_x_kamikaze_x_x

  • Jr. Member
  • **
  • Karma: 18
  • Offline Offline
  • Posts: 83
Re: Error compiling aMule SVN:10773
« Reply #3 on: April 13, 2012, 02:23:33 AM »

Sorry for every time I contact with you it's just for telling problems... I apologize.
No need to apologize, we are always thankful for feedback!

If you say so...  :)

Command for compile:
Code: [Select]
sudo rm -r /
XDDDD  Joking   ;)
LOL, I hope nobody copies that blindly...  ;D
I hope it too!   ;D

Problem is here:
Code: [Select]
  Libraries aMule will use to build:
                             wxWidgets             2.8.12 (gtk2,shared)
                             crypto++              5.6.1 (installed, in /usr)
                             libupnp               1.8.0~svn20100401
It's supposed to be
Code: [Select]
                             libupnp               1.6.6

Oki dokie!  :)
Changing libupnp version...

Did you change anything in your Linux installation regarding UPnP?
Nop, just installed the last libupnp versiob (libupnp4-dev )

1.6.6 is the one and only version that works.
The correct Ubuntu package is libupnp3-dev .
Maybe it will be better if that "comment" appear on the result of ./config in order to advise the  beta-testers users...
What do you thing?
It's just to show a warning if it detected a version different of 1.6.6.

Easiest way to fix it is of course to add --disable-upnp to your configure options. If you have forwarded your ports in your router you don't need UPnP.

Of course it's the easiest way! and a more easiest way it's just install the older (2.2.6) version of aMule,
but...  I prefer play hard sometimes...  XDDDD   ;)

See you soon!  :)
Logged