aMule Forum

Please login or register.

Login with username, password and session length
Advanced search  

News:

We're back! (IN POG FORM)

Author Topic: errore durante la compilazione su freebsd 5.2.1  (Read 2187 times)

slupz

  • Newbie
  • Karma: 0
  • Offline Offline
  • Posts: 3
errore durante la compilazione su freebsd 5.2.1
« on: August 22, 2004, 11:16:57 PM »

ciaao a tutti,
durante l installazione di amule 2.0.0rc5 mi da questoo errore
/usr/bin/ld: cannot find -lwx_gtk2-2.4
gmake[6]: *** [wxcas] Error 1
gmake[6]: Leaving directory `/usr/home/slupz/amule/work/aMule-2.0.0rc5/src/utils/wxCas/src'
gmake[5]: *** [all-recursive] Error 1
gmake[5]: Leaving directory `/usr/home/slupz/amule/work/aMule-2.0.0rc5/src/utils/wxCas'
gmake[4]: *** [all-recursive] Error 1
gmake[4]: Leaving directory `/usr/home/slupz/amule/work/aMule-2.0.0rc5/src/utils'
gmake[3]: *** [all-recursive] Error 1
gmake[3]: Leaving directory `/usr/home/slupz/amule/work/aMule-2.0.0rc5/src'
gmake[2]: *** [all] Error 2
gmake[2]: Leaving directory `/usr/home/slupz/amule/work/aMule-2.0.0rc5/src'
gmake[1]: *** [all-recursive] Error 1
gmake[1]: Leaving directory `/usr/home/slupz/amule/work/aMule-2.0.0rc5'
gmake: *** [all] Error 2
*** Error code 2
hoo provato a cercare lwx_gtk2-2.4 ma proprio non esiste qualcuno sa aiutarmi?
grazie
Logged

narkos

  • Newbie
  • Karma: 0
  • Offline Offline
  • Posts: 2
    • http://narkos.angri.com
RE: errore durante la compilazione su freebsd 5.2.1
« Reply #1 on: September 15, 2004, 08:07:57 PM »

forse non hai installato per bene la wxGTK2.4.2

cmq qui c'รจ la guida su come installare aMule su FreeBSD

spero ti sia utile
Logged