aMule Forum

Please login or register.

Login with username, password and session length
Advanced search  

News:

We're back! (IN POG FORM)

Pages: 1 ... 8 9 [10]
 91 
 on: June 12, 2017, 09:21:01 AM 
Started by wurstauge - Last post by GonoszTopi
managed to install all necessary packages including wxWidget3.1.

Use wxWidgets 3.0, aMule does not compile with 3.1.

 92 
 on: June 11, 2017, 02:15:42 PM 
Started by wurstauge - Last post by wurstauge
Hi,

I'm new here in this forum and not really experienced with Linux. On my shuttle XP35 I have installed Ubuntu 16.04.02. It works well. Installing aMule (2.4.0) was not a problem neither. But aMule keeps on crashing every few hours. In this forum I found a post related to this issue which recommends to compile aMule 2.3.1 myself.
I found a lot of helpful posts and managed to install all necessary packages including wxWidget3.1. Compiling aMule works well, just one warning about a minor item. After I started 'make' the following error occurs:

eule@shuttle-01:~/Downloads/aMule-2.3.2$ make
[sudo] password for eule:
Compiling listctrl.cpp
extern/wxWidgets/listctrl.cpp: In member function ‘void MuleExtern::wxListMainWindow::OnScroll(wxScrollWinEvent&)’:
extern/wxWidgets/listctrl.cpp:4864:5: error: ‘OnScroll’ is not a member of ‘wxScrolledWindow’
     wxScrolledWindow::OnScroll(event);
     ^
Makefile:1620: recipe for target 'libmuleappgui_a-listctrl.o' failed
make[3]: *** [libmuleappgui_a-listctrl.o] Error 1
Makefile:3260: recipe for target 'all-recursive' failed
make[2]: *** [all-recursive] Error 1
Makefile:490: recipe for target 'all-recursive' failed
make[1]: *** [all-recursive] Error 1
Makefile:397: recipe for target 'all' failed
make: *** [all] Error 2

I don't have any clue what this could mean, neither an idea how to solve this.

 93 
 on: June 05, 2017, 06:23:00 PM 
Started by klode82 - Last post by GonoszTopi
Glad to help :)

 94 
 on: June 05, 2017, 06:21:41 PM 
Started by gnazio - Last post by GonoszTopi
Fixed in 10990. Thanks for the report.

 95 
 on: June 04, 2017, 07:12:25 AM 
Started by klode82 - Last post by klode82
Salve,
ho da poco installato la nuova SVN, la 10989. L'installazione è andata a buon fine.

Però ho dei problemi:
1. Le porte in uso sono: TCP 14662 ( e TCP+3 ) - UDP 14667
2. Dopo la connessione ad un server ed2K, ottengo ID alto
3. Eseguo la connessione a KAD e non ci sono problemi.

Dopo alcuni minuti, però, il KAD si disconnette e sono costretto a riconnetterlo, ma a seguire rimane in Firewalled e mi dice:

Code: [Select]
Connection state: Firewalled - open TCP port 14662 on your router or firewall
UDP Connection state: Firewalled - open UDP port 14667 on your router or firewall

Ho fatto i miei test per verificare se le porte sono aperte o meno, e lo sono. Difatti il Server ED2K resta connesso, non Firewalled, e con ID Alto.

Inoltre, le connessioni in Upload non reggono. Tenete presente che ho una connessione Fibra, ed ho impostato una banda di 400KByte, con slot da 40Kb. Nonostante questo, non va.
Se fermo i Download, però, l'Upload se ne vola a 400Kb!  ???

Un pò strano, non trovate?

chi vuole aiutarmi a capire questo strano mistero?

 96 
 on: June 04, 2017, 07:02:46 AM 
Started by klode82 - Last post by klode82
Mr. GonoszTopi, you are the BEST!

I've checked some package still installed on my distro. amule-common, amule-utils and another one package (now I don't remember the name!) was installed, from the Ubuntu repository. I've then removed all packages.

Now, I've installed amule from the new SVN 10989 and it works fine.

There are still some issue, but nothing related compiling.

 97 
 on: June 04, 2017, 07:00:37 AM 
Started by gnazio - Last post by klode82
Yeah, right. I've modified  myself the file. After that, the make works fine

 98 
 on: June 03, 2017, 11:32:32 PM 
Started by gnazio - Last post by gnazio
In this commit there is an error:
http://repo.or.cz/amule.git/blobdiff/397ec4cbe80d8f6647f42bcbff55de297223210f..f01178bffda29e5f447e0a547d648d8f50fb6a12:/src/OtherFunctions.cpp

Code: [Select]
!wxCHECK_VERION(3,0,3)VERSION is mispelled (missing S)

 99 
 on: June 02, 2017, 07:53:10 PM 
Started by klode82 - Last post by GonoszTopi
Code: [Select]
Assertion failed: ../../src/kademlia/net/KademliaUDPListener.cpp:Process2HelloRequest:527: Assertion 'contactVersion >= 2' failed.

This issue was fixed in rev. 10908 (9 Mar 2016), and no later versions can produce this error message. Please make sure the version you run is the same version you think to run...

 100 
 on: June 02, 2017, 02:57:47 PM 
Started by klode82 - Last post by klode82
Hi GiniszTopi!  :D

Ahm... sorry... What?  :o
I'm using aMule SVN 10983, I think it is just the latest version, I mean.

what package is old more than 1 year?...

Pages: 1 ... 8 9 [10]