aMule Forum

Please login or register.

Login with username, password and session length
Advanced search  

News:

We're back! (IN POG FORM)

Author Topic: Compiler läuft nicht durch seit 10755  (Read 1337 times)

Schuttwegraeumer

  • Sr. Member
  • ****
  • Karma: 2
  • Offline Offline
  • Posts: 373
Compiler läuft nicht durch seit 10755
« on: February 12, 2012, 11:46:28 PM »

Auch die 10757 zeigt das Problem:

Quote
/usr/include/wx-2.9/wx/string.h:2325:   instantiated from ‘static wxString wxString::Format(const wxFormatString&, T1) [with T1 = float]’
/usr/include/wx-2.9/wx/string.h:2103:   instantiated from here
/usr/include/wx-2.9/wx/strvararg.h:445: warning: unused parameter ‘fmt’
/usr/include/wx-2.9/wx/strvararg.h:445: warning: unused parameter ‘index’
/usr/include/wx-2.9/wx/strvararg.h: In instantiation of ‘wxArgNormalizer<T>::wxArgNormalizer(T, const wxFormatString*, unsigned int) [with T = double]’:
/usr/include/wx-2.9/wx/strvararg.h:481:   instantiated from ‘wxArgNormalizerUtf8<T>::wxArgNormalizerUtf8(T, const wxFormatString*, unsigned int) [with T = double]’
/usr/include/wx-2.9/wx/string.h:2325:   instantiated from ‘static wxString wxString::Format(const wxFormatString&, T1) [with T1 = double]’
/usr/include/wx-2.9/wx/string.h:2106:   instantiated from here
/usr/include/wx-2.9/wx/strvararg.h:445: warning: unused parameter ‘fmt’
/usr/include/wx-2.9/wx/strvararg.h:445: warning: unused parameter ‘index’
make[3]: *** [amule-Statistics.o] Fehler 1
make[3]: Verlasse Verzeichnis '/home/schutti/Desktop/X/aMule/amule/src'
make[2]: *** [all-recursive] Fehler 1
make[2]: Verlasse Verzeichnis '/home/schutti/Desktop/X/aMule/amule/src'
make[1]: *** [all-recursive] Fehler 1
make[1]: Verlasse Verzeichnis '/home/schutti/Desktop/X/aMule/amule'
make: *** [all] Fehler 2
schutti@hell:~/Desktop/X/aMule/amule$
Logged