aMule Forum

Please login or register.

Login with username, password and session length
Advanced search  

News:

We're back! (IN POG FORM)

Author Topic: Error compilando amule..  (Read 2172 times)

|Luis|

  • Approved Newbie
  • *
  • Karma: 0
  • Offline Offline
  • Posts: 14
Error compilando amule..
« on: December 04, 2005, 11:19:25 AM »

Ya habia compilado amule pero ahora me sale un error al hacer el make que no entiendo os pego el codigo.
Code: [Select]
make[4]: Entering directory `/home/exide/.local/share/Trash/files/amule-cvs/src'
flex -o Scanner.cpp Scanner.l; \
        cp Scanner.h.in Scanner.h
flex: can't open Scanner.cpp
if g++ -DHAVE_CONFIG_H -I. -I. -I..    -I/usr//lib/wx/include/gtk2-unicode-release-2.6 -I/usr//include/wx-2.6 -DGTK_NO_CHECK_CASTS -D__WXGTK__ -D_FILE_OFFSET_BITS=64 -D_LARGE_FILES -D_LARGEFILE_SOURCE=1 -DNO_GCC_PRAGMA   -I./libs -DUSE_EMBEDDED_CRYPTO -W -Wall -Wshadow -Wundef   -MT libmuleappcore_a-Scanner.o -MD -MP -MF ".deps/libmuleappcore_a-Scanner.Tpo" -c -o libmuleappcore_a-Scanner.o `test -f 'Scanner.cpp' || echo './'`Scanner.cpp; \
then mv -f ".deps/libmuleappcore_a-Scanner.Tpo" ".deps/libmuleappcore_a-Scanner.Po"; else rm -f ".deps/libmuleappcore_a-Scanner.Tpo"; exit 1; fi
g++: ./Scanner.cpp: No existe el fichero o el directorio
g++: no input files
make[4]: *** [libmuleappcore_a-Scanner.o] Error 1
make[4]: Leaving directory `/home/exide/.local/share/Trash/files/amule-cvs/src'
make[3]: *** [all-recursive] Error 1
make[3]: Leaving directory `/home/exide/.local/share/Trash/files/amule-cvs/src'
make[2]: *** [all] Error 2
make[2]: Leaving directory `/home/exide/.local/share/Trash/files/amule-cvs/src'
make[1]: *** [all-recursive] Error 1
make[1]: Leaving directory `/home/exide/.local/share/Trash/files/amule-cvs'
make: *** [all] Error 2

¿Que puedo hacer?, Gracias.

Un saludo.
Logged

Gerd78

  • Hero Member
  • *****
  • Karma: 9
  • Offline Offline
  • Posts: 681
Re: Error compilando amule..
« Reply #1 on: December 04, 2005, 02:30:22 PM »

You have yesterday's CVS. Please download today's CVS, where this problem has been fixed.
Logged

Jacobo221

  • Hero Member
  • *****
  • Karma: 3
  • Offline Offline
  • Posts: 2711
Re: Error compilando amule..
« Reply #2 on: December 04, 2005, 03:06:24 PM »

el cvs de ayer no compilaba. como dice Gerd78, bajate el de hoy que si compila. un saludo.
Logged

|Luis|

  • Approved Newbie
  • *
  • Karma: 0
  • Offline Offline
  • Posts: 14
Gracias
« Reply #3 on: December 04, 2005, 06:55:33 PM »

Gerd78,   thanks thanks  ;)

Jacobo221 muchisimas gracias, ya sabes que no se me da muy bien el inglés no?  ;) xD.
Logged

|Luis|

  • Approved Newbie
  • *
  • Karma: 0
  • Offline Offline
  • Posts: 14
Re: Error compilando amule..
« Reply #4 on: December 05, 2005, 07:43:47 AM »

Me sigue dando un error:

Pd: Ya se que habia un bug en la cvs pero ahora he probado la cvs de hoy y sigue igual he visto foros y el error que les sale no es el mismo que a mí no se si me falta alguna dependencia, todo esto al hacer el make.

Code: [Select]
make  all-recursive
make[1]: Entering directory `/home/exide/Desktop/amule-cvs'
Making all in m4
make[2]: Entering directory `/home/exide/Desktop/amule-cvs/m4'
make[2]: No se hace nada para `all'.
make[2]: Leaving directory `/home/exide/Desktop/amule-cvs/m4'
Making all in docs
make[2]: Entering directory `/home/exide/Desktop/amule-cvs/docs'
Making all in man
make[3]: Entering directory `/home/exide/Desktop/amule-cvs/docs/man'
make[3]: No se hace nada para `all'.
make[3]: Leaving directory `/home/exide/Desktop/amule-cvs/docs/man'
make[3]: Entering directory `/home/exide/Desktop/amule-cvs/docs'
make[3]: No se hace nada para `all-am'.
make[3]: Leaving directory `/home/exide/Desktop/amule-cvs/docs'
make[2]: Leaving directory `/home/exide/Desktop/amule-cvs/docs'
Making all in src
make[2]: Entering directory `/home/exide/Desktop/amule-cvs/src'
Making all in libs
make[3]: Entering directory `/home/exide/Desktop/amule-cvs/src/libs'
Making all in ec
make[4]: Entering directory `/home/exide/Desktop/amule-cvs/src/libs/ec'
make  all-am
make[5]: Entering directory `/home/exide/Desktop/amule-cvs/src/libs/ec'
make[5]: No se hace nada para `all-am'.
make[5]: Leaving directory `/home/exide/Desktop/amule-cvs/src/libs/ec'
make[4]: Leaving directory `/home/exide/Desktop/amule-cvs/src/libs/ec'
Making all in common
make[4]: Entering directory `/home/exide/Desktop/amule-cvs/src/libs/common'
make[4]: No se hace nada para `all'.
make[4]: Leaving directory `/home/exide/Desktop/amule-cvs/src/libs/common'
make[4]: Entering directory `/home/exide/Desktop/amule-cvs/src/libs'
make[4]: No se hace nada para `all-am'.
make[4]: Leaving directory `/home/exide/Desktop/amule-cvs/src/libs'
make[3]: Leaving directory `/home/exide/Desktop/amule-cvs/src/libs'
Making all in utils
make[3]: Entering directory `/home/exide/Desktop/amule-cvs/src/utils'
Making all in xas
make[4]: Entering directory `/home/exide/Desktop/amule-cvs/src/utils/xas'
Making all in docs
make[5]: Entering directory `/home/exide/Desktop/amule-cvs/src/utils/xas/docs'
make[5]: No se hace nada para `all'.
make[5]: Leaving directory `/home/exide/Desktop/amule-cvs/src/utils/xas/docs'
make[5]: Entering directory `/home/exide/Desktop/amule-cvs/src/utils/xas'
make[5]: No se hace nada para `all-am'.
make[5]: Leaving directory `/home/exide/Desktop/amule-cvs/src/utils/xas'
make[4]: Leaving directory `/home/exide/Desktop/amule-cvs/src/utils/xas'
make[4]: Entering directory `/home/exide/Desktop/amule-cvs/src/utils'
make[4]: No se hace nada para `all-am'.
make[4]: Leaving directory `/home/exide/Desktop/amule-cvs/src/utils'
make[3]: Leaving directory `/home/exide/Desktop/amule-cvs/src/utils'
Making all in pixmaps
make[3]: Entering directory `/home/exide/Desktop/amule-cvs/src/pixmaps'
make[3]: No se hace nada para `all'.
make[3]: Leaving directory `/home/exide/Desktop/amule-cvs/src/pixmaps'
Making all in kademlia
make[3]: Entering directory `/home/exide/Desktop/amule-cvs/src/kademlia'
Making all in io
make[4]: Entering directory `/home/exide/Desktop/amule-cvs/src/kademlia/io'
make[4]: No se hace nada para `all'.
make[4]: Leaving directory `/home/exide/Desktop/amule-cvs/src/kademlia/io'
Making all in kademlia
make[4]: Entering directory `/home/exide/Desktop/amule-cvs/src/kademlia/kademlia'
make[4]: No se hace nada para `all'.
make[4]: Leaving directory `/home/exide/Desktop/amule-cvs/src/kademlia/kademlia'
Making all in net
make[4]: Entering directory `/home/exide/Desktop/amule-cvs/src/kademlia/net'
make[4]: No se hace nada para `all'.
make[4]: Leaving directory `/home/exide/Desktop/amule-cvs/src/kademlia/net'
Making all in routing
make[4]: Entering directory `/home/exide/Desktop/amule-cvs/src/kademlia/routing'
make[4]: No se hace nada para `all'.
make[4]: Leaving directory `/home/exide/Desktop/amule-cvs/src/kademlia/routing'
Making all in utils
make[4]: Entering directory `/home/exide/Desktop/amule-cvs/src/kademlia/utils'
make[4]: No se hace nada para `all'.
make[4]: Leaving directory `/home/exide/Desktop/amule-cvs/src/kademlia/utils'
make[4]: Entering directory `/home/exide/Desktop/amule-cvs/src/kademlia'
make[4]: No se hace nada para `all-am'.
make[4]: Leaving directory `/home/exide/Desktop/amule-cvs/src/kademlia'
make[3]: Leaving directory `/home/exide/Desktop/amule-cvs/src/kademlia'
make[3]: Entering directory `/home/exide/Desktop/amule-cvs/src'
make[3]: No se hace nada para `all-am'.
make[3]: Leaving directory `/home/exide/Desktop/amule-cvs/src'
make[2]: Leaving directory `/home/exide/Desktop/amule-cvs/src'
Making all in unittests
make[2]: Entering directory `/home/exide/Desktop/amule-cvs/unittests'
make[3]: Entering directory `/home/exide/Desktop/amule-cvs/unittests'
make[3]: No se hace nada para `all-am'.
make[3]: Leaving directory `/home/exide/Desktop/amule-cvs/unittests'
make[2]: Leaving directory `/home/exide/Desktop/amule-cvs/unittests'
Making all in intl
make[2]: Entering directory `/home/exide/Desktop/amule-cvs/intl'
make[2]: No se hace nada para `all'.
make[2]: Leaving directory `/home/exide/Desktop/amule-cvs/intl'
Making all in po
make[2]: Entering directory `/home/exide/Desktop/amule-cvs/po'
make[2]: No se hace nada para `all'.
make[2]: Leaving directory `/home/exide/Desktop/amule-cvs/po'
make[2]: Entering directory `/home/exide/Desktop/amule-cvs'
make[2]: No se hace nada para `all-am'.
make[2]: Leaving directory `/home/exide/Desktop/amule-cvs'
make[1]: Leaving directory `/home/exide/Desktop/amule-cvs'


Gracias.
Logged

Jacobo221

  • Hero Member
  • *****
  • Karma: 3
  • Offline Offline
  • Posts: 2711
Re: Error compilando amule..
« Reply #5 on: December 05, 2005, 08:07:31 AM »

no te esta dando ningun error. probablemente ya esta compilado. o sino, no has pegado tolo lo que sale al hacer make, porque ahi lo unico que dice es que no tiene nada que hacer porque ya esta todo hecho.
haz "make install" (como root) para acabar la compilacion
Logged

|Luis|

  • Approved Newbie
  • *
  • Karma: 0
  • Offline Offline
  • Posts: 14
Error técnico.
« Reply #6 on: December 05, 2005, 02:37:58 PM »

Completo, muchisimas gracias de nuevo.
Logged

Jacobo221

  • Hero Member
  • *****
  • Karma: 3
  • Offline Offline
  • Posts: 2711
Re: Error compilando amule..
« Reply #7 on: December 05, 2005, 04:53:32 PM »

;)
Logged